BDBM396383 3-[5-Bromo-2-(3-trifluoromethyl-benzyloxy)-phenoxy]-azetidine::US9981909, Example 8
SMILES FC(F)(F)c1cccc(COc2ccc(Br)cc2OC2CNC2)c1
InChI Key InChIKey=CWAYESQBOZBJAS-UHFFFAOYSA-N
Data  2 KI
  Tab Delimited (TSV)   2D SDfile   Computed 3D by Vconf -m prep SDfile
Find this compound or compounds like it in BindingDB:
Activity Spreadsheet -- Enzyme Inhibition Constant Data from BindingDB
Found 2 hits for monomerid = 396383
TargetSodium-dependent serotonin transporter(Homo sapiens (Human))
Janssen Pharmaceutica
US Patent
LigandPNGBDBM396383(3-[5-Bromo-2-(3-trifluoromethyl-benzyloxy)-phenoxy...)
Affinity DataKi:  4nM. Assay description: Receptor binding was performed using membrane fractions prepared from the HEK-293 cell line recombinantly expressing rat 5-HT7 receptors (NCBI access...
Ligand InfoPC cidPC sid
In DepthDetails US Patent
Target5-hydroxytryptamine receptor 7(Rattus norvegicus (rat))
Janssen Pharmaceutica
US Patent
LigandPNGBDBM396383(3-[5-Bromo-2-(3-trifluoromethyl-benzyloxy)-phenoxy...)
Affinity DataKi:  6nM. Assay description: Receptor binding was performed using membrane fractions prepared from the HEK-293 cell line recombinantly expressing rat 5-HT7 receptors (NCBI access...
Ligand InfoPC cidPC sid
In DepthDetails US Patent