BDBM39658 MLS000518935::N-ethyl-3-nitro-N-(3-nitrophenyl)azoaniline::N-ethyl-3-nitro-N-[(3-nitrophenyl)diazenyl]aniline::SMR000129355::cid_5123073::ethyl-(3-nitrophenyl)-(3-nitrophenyl)azo-amine
SMILES CCN(\N=N\c1cccc(c1)[N+]([O-])=O)c1cccc(c1)[N+]([O-])=O
InChI Key InChIKey=HTOABIVQTINXDJ-FOCLMDBBSA-N
Data  1 IC50  1 EC50
  Tab Delimited (TSV)   2D SDfile   Computed 3D by Vconf -m prep SDfile
Find this compound or compounds like it in BindingDB:
Activity Spreadsheet -- Enzyme Inhibition Constant Data from BindingDB
Found 2 hits for monomerid = 39658
TargetAlkaline phosphatase, germ cell type(Homo sapiens (Human))
Burnham Center For Chemical Genomics
Curated by PubChem BioAssay
LigandPNGBDBM39658(MLS000518935 | N-ethyl-3-nitro-N-(3-nitrophenyl)az...)
Affinity DataEC50:  9.99E+5nM. Assay description: Sanford-Burnham Center for Chemical Genomics (SBCCG) Sanford-Burnham Medical Research Institute (SBMRI, San Diego, CA) NIH Molecular Libraries Screen...
In DepthDetails PCBioAssay
TargetAlkaline phosphatase, germ cell type(Homo sapiens (Human))
Burnham Center For Chemical Genomics
Curated by PubChem BioAssay
LigandPNGBDBM39658(MLS000518935 | N-ethyl-3-nitro-N-(3-nitrophenyl)az...)
Affinity DataIC50:  9.99E+5nM. Assay description: Sanford-Burnham Center for Chemical Genomics (SBCCG) Sanford-Burnham Medical Research Institute (SBMRI, San Diego, CA) NIH Molecular Libraries Screen...
In DepthDetails PCBioAssay