BDBM396692 6-(6'-fluoro-[2,2'-bipyridin]-3- yl)imidazo[1,2-a]pyridine-3-carboxamide::US9981944, Example 37
SMILES NC(=O)c1cnc2ccc(cn12)-c1cccnc1-c1cccc(F)n1
InChI Key InChIKey=PDLOIKWMTHAUIQ-UHFFFAOYSA-N
Data  2 IC50
  Tab Delimited (TSV)   2D SDfile   Computed 3D by Vconf -m prep SDfile
Find this compound or compounds like it in BindingDB:
Activity Spreadsheet -- Enzyme Inhibition Constant Data from BindingDB
Found 2 hits for monomerid = 396692
TargetTGF-beta receptor type-2(Homo sapiens (Human))
Rigel Pharmaceuticals
US Patent
LigandPNGBDBM396692(6-(6'-fluoro-[2,2'-bipyridin]-3- yl)imidazo[1,2-a]...)
Affinity DataIC50:  1.60E+3nM. Assay description: Assays for the compounds reported below were conducted in 1536-well plates and 2 mL reactions are prepared from addition of HIS-TGFβR1 T204D or ...
Ligand InfoPC cidPC sid
In DepthDetails US Patent
TargetTGF-beta receptor type-1 [T204D](Homo sapiens (Human))
Rigel Pharmaceuticals
US Patent
LigandPNGBDBM396692(6-(6'-fluoro-[2,2'-bipyridin]-3- yl)imidazo[1,2-a]...)
Affinity DataIC50:  4nM. Assay description: Assays for the compounds reported below were conducted in 1536-well plates and 2 mL reactions are prepared from addition of HIS-TGFβR1 T204D or ...
Ligand InfoPC cidPC sid
In DepthDetails US Patent