BDBM396769 6-(6'-(trifluoromethyl)-[2,2'-bipyridin]-3- yl)quinoxaline::US9981944, Example 114
SMILES FC(F)(F)c1cccc(n1)-c1ncccc1-c1ccc2nccnc2c1
InChI Key InChIKey=MQNBKVRVTGHUOO-UHFFFAOYSA-N
Data  2 IC50
  Tab Delimited (TSV)   2D SDfile   Computed 3D by Vconf -m prep SDfile
Find this compound or compounds like it in BindingDB:
Activity Spreadsheet -- Enzyme Inhibition Constant Data from BindingDB
Found 2 hits for monomerid = 396769
TargetTGF-beta receptor type-2(Homo sapiens (Human))
Rigel Pharmaceuticals
US Patent
LigandPNGBDBM396769(6-(6'-(trifluoromethyl)-[2,2'-bipyridin]-3- yl)qui...)
Affinity DataIC50: >1.50E+4nM. Assay description: Assays for the compounds reported below were conducted in 1536-well plates and 2 mL reactions are prepared from addition of HIS-TGFβR1 T204D or ...
Ligand InfoPC cidPC sid
In DepthDetails US Patent
TargetTGF-beta receptor type-1 [T204D](Homo sapiens (Human))
Rigel Pharmaceuticals
US Patent
LigandPNGBDBM396769(6-(6'-(trifluoromethyl)-[2,2'-bipyridin]-3- yl)qui...)
Affinity DataIC50:  16nM. Assay description: Assays for the compounds reported below were conducted in 1536-well plates and 2 mL reactions are prepared from addition of HIS-TGFβR1 T204D or ...
Ligand InfoPC cidPC sid
In DepthDetails US Patent