BDBM396826 US9981950, Example 33
SMILES CCc1nccn1Cc1cn(nn1)-c1ccc(Cl)c(Cl)c1
InChI Key InChIKey=ACNAPZHYUZOZJN-UHFFFAOYSA-N
Data  3 IC50
  Tab Delimited (TSV)   2D SDfile   Computed 3D by Vconf -m prep SDfile
Find this compound or compounds like it in BindingDB:
Activity Spreadsheet -- Enzyme Inhibition Constant Data from BindingDB
Found 3 hits for monomerid = 396826
TargetPotassium voltage-gated channel subfamily H member 2(Homo sapiens (Human))
Janssen Pharmaceuticals
US Patent
LigandPNGBDBM396826(US9981950, Example 33)
Affinity DataIC50:  4.65nM. Assay description: Cells were split 2-3 times weekly between 1:3 and 1:4. For binding assays and membrane preparations the cell culture medium was removed, cells were w...
In DepthDetails US Patent
TargetPotassium voltage-gated channel subfamily H member 2(Homo sapiens (Human))
Janssen Pharmaceuticals
US Patent
LigandPNGBDBM396826(US9981950, Example 33)
Affinity DataIC50:  4.65nM. Assay description: TBD
In DepthDetails US Patent
TargetGlutamate receptor ionotropic, NMDA 2B(Rattus norvegicus (Rat))
Janssen Pharmaceuticals
US Patent
LigandPNGBDBM396826(US9981950, Example 33)
Affinity DataIC50:  4.65nM. Assay description: Male Wistar rats (180 to 200 g) were killed by suffocation in a CO2 chamber for two minutes. Whole brains without cerebellum were removed and dissect...
In DepthDetails US Patent