BDBM397063 US10442810, Example 126::US10844069, Example 126::US11591338, Example 126::US9981975, Example 126
SMILES CC(C)C(=O)N1CCC(CC1)c1cc(-c2ccc(NC(=O)c3cc(-c4ncco4)c(C)n(-c4ccccn4)c3=O)cc2)c2c(N)ncnn12
InChI Key InChIKey=FIJMVZSPQNZCOR-UHFFFAOYSA-N
Data  12 IC50
  Tab Delimited (TSV)   2D SDfile   Computed 3D by Vconf -m prep SDfile
Find this compound or compounds like it in BindingDB:
Activity Spreadsheet -- Enzyme Inhibition Constant Data from BindingDB
Found 12 hits for monomerid = 397063
TargetTyrosine-protein kinase receptor UFO(Homo sapiens (Human))
Incyte
US Patent
LigandPNGBDBM397063(US10442810, Example 126 | US10844069, Example 126 ...)
Affinity DataIC50: <5nM. Assay description: Autophosphorylation of Axl was carried out by incubating the recombinant Axl protein (Life Technologies, PV4275) in buffer containing 50 mM Tris, pH7...
Ligand InfoPC cidPC sid
In DepthDetails US Patent
TargetTyrosine-protein kinase Mer(Homo sapiens (Human))
Incyte
US Patent
LigandPNGBDBM397063(US10442810, Example 126 | US10844069, Example 126 ...)
Affinity DataIC50: <5nM. Assay description: Tyro3, and Mer:The kinase assay buffer contained 50 mM HEPES, pH7.5, 10 mM MgCl2, 1 mM EGTA, 0.01% NP-40 and 2 mM DTT. 0.1 ul test compounds dissolve...
Ligand InfoPC cidPC sid
In DepthDetails US Patent
TargetTyrosine-protein kinase receptor TYRO3(Homo sapiens (Human))
Incyte
US Patent
LigandPNGBDBM397063(US10442810, Example 126 | US10844069, Example 126 ...)
Affinity DataIC50: >100nM. Assay description: Tyro3, and Mer:The kinase assay buffer contained 50 mM HEPES, pH7.5, 10 mM MgCl2, 1 mM EGTA, 0.01% NP-40 and 2 mM DTT. 0.1 ul test compounds dissolve...
Ligand InfoPC cidPC sid
In DepthDetails US Patent
TargetTyrosine-protein kinase receptor UFO(Homo sapiens (Human))
Incyte
US Patent
LigandPNGBDBM397063(US10442810, Example 126 | US10844069, Example 126 ...)
Affinity DataIC50: <5nM. Assay description: The kinase assay buffer contained 50 mM HEPES, pH7.5, 10 mM MgCl2, 1 mM EGTA, 0.01% NP-40 and 2 mM DTT. 0.1 ul test compounds dissolved in DMSO were ...
Ligand InfoPC cidPC sid
In DepthDetails US Patent
TargetTyrosine-protein kinase Mer(Homo sapiens (Human))
Incyte
US Patent
LigandPNGBDBM397063(US10442810, Example 126 | US10844069, Example 126 ...)
Affinity DataIC50: <5nM. Assay description: The kinase assay buffer contained 50 mM HEPES, pH7.5, 10 mM MgCl2, 1 mM EGTA, 0.01% NP-40 and 2 mM DTT. 0.1 ul test compounds dissolved in DMSO were ...
Ligand InfoPC cidPC sid
In DepthDetails US Patent
TargetTyrosine-protein kinase receptor TYRO3(Homo sapiens (Human))
Incyte
US Patent
LigandPNGBDBM397063(US10442810, Example 126 | US10844069, Example 126 ...)
Affinity DataIC50: <5nM. Assay description: The kinase assay buffer contained 50 mM HEPES, pH7.5, 10 mM MgCl2, 1 mM EGTA, 0.01% NP-40 and 2 mM DTT. 0.1 ul test compounds dissolved in DMSO were ...
Ligand InfoPC cidPC sid
In DepthDetails US Patent
TargetTyrosine-protein kinase receptor UFO(Homo sapiens (Human))
Incyte
US Patent
LigandPNGBDBM397063(US10442810, Example 126 | US10844069, Example 126 ...)
Affinity DataIC50: <5nM. Assay description: The kinase assay buffer contained 50 mM HEPES, pH7.5, 10 mM MgCl2, 1 mM EGTA, 0.01% NP-40 and 2 mM DTT. 0.1 ul test compounds dissolved in DMSO were ...
Ligand InfoPC cidPC sid
In DepthDetails US Patent
TargetTyrosine-protein kinase Mer(Homo sapiens (Human))
Incyte
US Patent
LigandPNGBDBM397063(US10442810, Example 126 | US10844069, Example 126 ...)
Affinity DataIC50: <5nM. Assay description: The kinase assay buffer contained 50 mM HEPES, pH7.5, 10 mM MgCl2, 1 mM EGTA, 0.01% NP-40 and 2 mM DTT. 0.1 ul test compounds dissolved in DMSO were ...
Ligand InfoPC cidPC sid
In DepthDetails US Patent
TargetTyrosine-protein kinase receptor TYRO3(Homo sapiens (Human))
Incyte
US Patent
LigandPNGBDBM397063(US10442810, Example 126 | US10844069, Example 126 ...)
Affinity DataIC50: >100nM. Assay description: The kinase assay buffer contained 50 mM HEPES, pH7.5, 10 mM MgCl2, 1 mM EGTA, 0.01% NP-40 and 2 mM DTT. 0.1 ul test compounds dissolved in DMSO were ...
Ligand InfoPC cidPC sid
In DepthDetails US Patent
TargetTyrosine-protein kinase receptor UFO(Homo sapiens (Human))
Incyte
US Patent
LigandPNGBDBM397063(US10442810, Example 126 | US10844069, Example 126 ...)
Affinity DataIC50: >100nM. Assay description: The kinase assay buffer contained 50 mM HEPES, pH7.5, 10 mM MgCl2, 1 mM EGTA, 0.01% NP-40 and 2 mM DTT. 0.1 ul test compounds dissolved in DMSO were ...
Ligand InfoPC cidPC sid
In DepthDetails US Patent
TargetTyrosine-protein kinase Mer(Homo sapiens (Human))
Incyte
US Patent
LigandPNGBDBM397063(US10442810, Example 126 | US10844069, Example 126 ...)
Affinity DataIC50: >100nM. Assay description: The kinase assay buffer contained 50 mM HEPES, pH7.5, 10 mM MgCl2, 1 mM EGTA, 0.01% NP-40 and 2 mM DTT. 0.1 ul test compounds dissolved in DMSO were ...
Ligand InfoPC cidPC sid
In DepthDetails US Patent
TargetTyrosine-protein kinase receptor TYRO3(Homo sapiens (Human))
Incyte
US Patent
LigandPNGBDBM397063(US10442810, Example 126 | US10844069, Example 126 ...)
Affinity DataIC50: >100nM. Assay description: The kinase assay buffer contained 50 mM HEPES, pH7.5, 10 mM MgCl2, 1 mM EGTA, 0.01% NP-40 and 2 mM DTT. 0.1 ul test compounds dissolved in DMSO were ...
Ligand InfoPC cidPC sid
In DepthDetails US Patent