BDBM39711 4-[2-(1,3-dihydrobenzimidazol-2-ylidene)-3-keto-3-(2-thienyl)propylidene]-2,6-dimethoxy-cyclohexa-2,5-dien-1-one::4-[2-(1,3-dihydrobenzimidazol-2-ylidene)-3-oxidanylidene-3-thiophen-2-yl-propylidene]-2,6-dimethoxy-cyclohexa-2,5-dien-1-one::4-[2-(1,3-dihydrobenzimidazol-2-ylidene)-3-oxo-3-thiophen-2-ylpropylidene]-2,6-dimethoxy-1-cyclohexa-2,5-dienone::4-[2-(1,3-dihydrobenzimidazol-2-ylidene)-3-oxo-3-thiophen-2-ylpropylidene]-2,6-dimethoxycyclohexa-2,5-dien-1-one::MLS000564302::SMR000151825::cid_5972274
SMILES COc1cc(C=C(C(=O)c2cccs2)c2nc3ccccc3[nH]2)cc(OC)c1O
InChI Key InChIKey=MRJPNJSUWJVJEX-UHFFFAOYSA-N
Data  4 IC50  2 EC50
  Tab Delimited (TSV)   2D SDfile   Computed 3D by Vconf -m prep SDfile
Find this compound or compounds like it in BindingDB:
Activity Spreadsheet -- Enzyme Inhibition Constant Data from BindingDB
Found 6 hits for monomerid = 39711
TargetAlkaline phosphatase, germ cell type(Homo sapiens (Human))
Burnham Center For Chemical Genomics
Curated by PubChem BioAssay
LigandPNGBDBM39711(4-[2-(1,3-dihydrobenzimidazol-2-ylidene)-3-keto-3-...)
Affinity DataIC50:  2.04E+4nM. Assay description: Sanford-Burnham Center for Chemical Genomics (SBCCG) Sanford-Burnham Medical Research Institute (SBMRI, San Diego, CA) NIH Molecular Libraries Screen...
In DepthDetails PCBioAssay
TargetTranscription factor p65(Homo sapiens (Human))
Srmlsc
Curated by PubChem BioAssay
LigandPNGBDBM39711(4-[2-(1,3-dihydrobenzimidazol-2-ylidene)-3-keto-3-...)
Affinity DataEC50:  7.67E+3nM. Assay description: Southern Research Molecular Libraries Screening Center (SRMLSC) Southern Research Institute (Birmingham, Alabama) NIH Molecular Libraries Screening C...
In DepthDetails PCBioAssay
TargetNuclear receptor coactivator 3(Homo sapiens (Human))
The Scripps Research Institute Molecular Screening Center
Curated by PubChem BioAssay
LigandPNGBDBM39711(4-[2-(1,3-dihydrobenzimidazol-2-ylidene)-3-keto-3-...)
Affinity DataIC50: >3.59E+4nM. Assay description: Source (MLPCN Center Name): The Scripps Research Institute Molecular Screening Center (SRIMSC) Affiliation: The Scripps Research Institute, TSRI Assa...
In DepthDetails PCBioAssay
TargetTegument protein VP16(Human herpesvirus 1 (strain 17) (HHV-1) (Human her...)
The Scripps Research Institute Molecular Screening Center
Curated by PubChem BioAssay
LigandPNGBDBM39711(4-[2-(1,3-dihydrobenzimidazol-2-ylidene)-3-keto-3-...)
Affinity DataIC50:  8.01E+3nM. Assay description: Source (MLPCN Center Name): The Scripps Research Institute Molecular Screening Center (SRIMSC) Affiliation: The Scripps Research Institute, TSRI Assa...
In DepthDetails PCBioAssay
TargetNuclear receptor coactivator 1(Homo sapiens (Human))
The Scripps Research Institute Molecular Screening Center
Curated by PubChem BioAssay
LigandPNGBDBM39711(4-[2-(1,3-dihydrobenzimidazol-2-ylidene)-3-keto-3-...)
Affinity DataIC50: >3.59E+4nM. Assay description: Source (MLPCN Center Name): The Scripps Research Institute Molecular Screening Center (SRIMSC) Affiliation: The Scripps Research Institute, TSRI Assa...
In DepthDetails PCBioAssay
TargetAlkaline phosphatase, germ cell type(Homo sapiens (Human))
Burnham Center For Chemical Genomics
Curated by PubChem BioAssay
LigandPNGBDBM39711(4-[2-(1,3-dihydrobenzimidazol-2-ylidene)-3-keto-3-...)
Affinity DataEC50:  9.99E+5nM. Assay description: Sanford-Burnham Center for Chemical Genomics (SBCCG) Sanford-Burnham Medical Research Institute (SBMRI, San Diego, CA) NIH Molecular Libraries Screen...
In DepthDetails PCBioAssay