BDBM397234 US10596172, Compound I-185::US10828300, Compound I-185::US11351168, Compound I-185::US9987276, Compound I-185
SMILES CC(=C)C(=O)c1ccc(Nc2nc(Nc3ccccc3)ncc2F)cc1
InChI Key InChIKey=OQGGDZLIFOFKSA-UHFFFAOYSA-N
Data  9 IC50
  Tab Delimited (TSV)   2D SDfile   Computed 3D by Vconf -m prep SDfile
Find this compound or compounds like it in BindingDB:
Activity Spreadsheet -- Enzyme Inhibition Constant Data from BindingDB
Found 9 hits for monomerid = 397234
TargetTyrosine-protein kinase ITK/TSK(Homo sapiens (Human))
Celgene Car
US Patent
LigandPNGBDBM397234(US10596172, Compound I-185 | US10828300, Compound ...)
Affinity DataIC50: <10nM. Assay description: ITK: This example describes continuous-read kinase assays to measure inherent potency of compound against active forms of ITK enzymes as described in...
Ligand InfoPC cidPC sid
In DepthDetails US Patent
TargetEpidermal growth factor receptor(Homo sapiens (Human))
Celgene Car
US Patent
LigandPNGBDBM397234(US10596172, Compound I-185 | US10828300, Compound ...)
Affinity DataIC50:  55nM. Assay description: EGFR (WT) and EGFR (T790M/L858R): The Omnia Assay Protocol for potency assessment against EGFR is performed as described in Example 251 above except ...
Ligand InfoPC cidPC sid
In DepthDetails US Patent
TargetTyrosine-protein kinase BTK(Homo sapiens (Human))
Celgene Car
US Patent
LigandPNGBDBM397234(US10596172, Compound I-185 | US10828300, Compound ...)
Affinity DataIC50: <10nM. Assay description: Briefly, 10× stocks of EGFR-WT (PV3872) from Invitrogen and EGFR-T790M/L858R (40350) from BPS Bioscience, San Diego, Calif., 1.13×ATP (AS001A) and ap...
Ligand InfoPC cidPC sid
In DepthDetails US Patent
TargetTyrosine-protein kinase ITK/TSK(Homo sapiens (Human))
Celgene Car
US Patent
LigandPNGBDBM397234(US10596172, Compound I-185 | US10828300, Compound ...)
Affinity DataIC50: <10nM. Assay description: Briefly, 10× stocks of EGFR-WT (PV3872) from Invitrogen and EGFR-T790M/L858R (40350) from BPS Bioscience, San Diego, Calif., 1.13×ATP (AS001A) and ap...
Ligand InfoPC cidPC sid
In DepthDetails US Patent
TargetEpidermal growth factor receptor(Homo sapiens (Human))
Celgene Car
US Patent
LigandPNGBDBM397234(US10596172, Compound I-185 | US10828300, Compound ...)
Affinity DataIC50:  550nM. Assay description: Briefly, 10x stocks of EGFR-WT (PV3872) from Invitrogen and EGFR-T790M/L858R (40350) from BPS Bioscience, San Diego, Calif., 1.13×ATP (AS001A) and ap...
Ligand InfoPC cidPC sid
In DepthDetails US Patent
TargetTyrosine-protein kinase BTK(Homo sapiens (Human))
Celgene Car
US Patent
LigandPNGBDBM397234(US10596172, Compound I-185 | US10828300, Compound ...)
Affinity DataIC50: <10nM. Assay description: Briefly, 10× stocks of EGFR-WT (PV3872) from Invitrogen and EGFR-T790M/L858R (40350) from BPS Bioscience, San Diego, Calif., 1.13×ATP (AS001A) and ap...
Ligand InfoPC cidPC sid
In DepthDetails US Patent
TargetTyrosine-protein kinase BTK(Homo sapiens (Human))
Celgene Car
US Patent
LigandPNGBDBM397234(US10596172, Compound I-185 | US10828300, Compound ...)
Affinity DataIC50: <100nM. Assay description: Briefly, 10x stocks of EGFR-WT (PV3872) from Invitrogen and EGFR-T790M/L858R (40350) from BPS Bioscience, San Diego, Calif., 1.13×ATP (AS001A) and ap...
Ligand InfoPC cidPC sid
In DepthDetails US Patent
TargetTyrosine-protein kinase ITK/TSK(Homo sapiens (Human))
Celgene Car
US Patent
LigandPNGBDBM397234(US10596172, Compound I-185 | US10828300, Compound ...)
Affinity DataIC50: <100nM. Assay description: Briefly, 10x stocks of EGFR-WT (PV3872) from Invitrogen and EGFR-T790M/L858R (40350) from BPS Bioscience, San Diego, Calif., 1.13×ATP (AS001A) and ap...
Ligand InfoPC cidPC sid
In DepthDetails US Patent
TargetEpidermal growth factor receptor(Homo sapiens (Human))
Celgene Car
US Patent
LigandPNGBDBM397234(US10596172, Compound I-185 | US10828300, Compound ...)
Affinity DataIC50:  55nM. Assay description: Briefly, 10× stocks of EGFR-WT (PV3872) from Invitrogen and EGFR-T790M/L858R (40350) from BPS Bioscience, San Diego, Calif., 1.13×ATP (AS001A) and ap...
Ligand InfoPC cidPC sid
In DepthDetails US Patent