BDBM397408 US9987278, Compound Reference 18
SMILES CCCNc1nc(NCCc2ccncc2)ncc1C(=O)NCCC(CC)NC(=O)CNC(=O)\C=C\CN(C)C
InChI Key InChIKey=DYBTVIIFUJPFPB-BQYQJAHWSA-N
Data  1 IC50
  Tab Delimited (TSV)   2D SDfile   Computed 3D by Vconf -m prep SDfile
Find this compound or compounds like it in BindingDB:
Activity Spreadsheet -- Enzyme Inhibition Constant Data from BindingDB
Found 1 hit for monomerid = 397408
TargetReceptor-type tyrosine-protein kinase FLT3 [D835Y](Homo sapiens (Human))
Fujifilm
US Patent
LigandPNGBDBM397408(US9987278, Compound Reference 18)
Affinity DataIC50: <1nM. Assay description: Quizartinib (Ambit Biosciences Corporation) was used as Reference Compound 1.6 μL (0.75 ng) of a mutant FLT3 protein (FLT3 D835Y, Life Technolog...
Ligand InfoPC cidPC sid
In DepthDetails US Patent