BDBM397419 US9987278, Compound Reference 29
SMILES CCCNc1nc(Nc2ccc(cc2)C(N)=O)ncc1C#Cc1cccc(NC(=O)[C@H](C)N(C)C(=O)\C=C\CN(C)C)c1
InChI Key InChIKey=HVPDFLQZEFAVCJ-NJTIBFSMSA-N
Data  1 IC50
  Tab Delimited (TSV)   2D SDfile   Computed 3D by Vconf -m prep SDfile
Find this compound or compounds like it in BindingDB:
Activity Spreadsheet -- Enzyme Inhibition Constant Data from BindingDB
Found 1 hit for monomerid = 397419
TargetReceptor-type tyrosine-protein kinase FLT3 [D835Y](Homo sapiens (Human))
Fujifilm
US Patent
LigandPNGBDBM397419(US9987278, Compound Reference 29)
Affinity DataIC50: <1nM. Assay description: Quizartinib (Ambit Biosciences Corporation) was used as Reference Compound 1.6 μL (0.75 ng) of a mutant FLT3 protein (FLT3 D835Y, Life Technolog...
Ligand InfoPC cidPC sid
In DepthDetails US Patent