BDBM397433 US10676470, Compound 2::US11332464, Compound 2::US9988375, Compound 2
SMILES NCCCC[C@H](NC(=O)C1CCCCC1)C(=O)c1nc2ccccc2s1
InChI Key InChIKey=JXHSPKLLOFASRK-INIZCTEOSA-N
Data  6 IC50
  Tab Delimited (TSV)   2D SDfile   Computed 3D by Vconf -m prep SDfile
Find this compound or compounds like it in BindingDB:
Activity Spreadsheet -- Enzyme Inhibition Constant Data from BindingDB
Found 6 hits for monomerid = 397433
TargetLys-gingipain W83(Porphyromonas gingivalis)
Cortexyme
US Patent
LigandPNGBDBM397433(US10676470, Compound 2 | US11332464, Compound 2 | ...)
Affinity DataIC50:  17.5nM. Assay description: The specific assay conditions were as follows. Buffer: pH=7.5, 100 mM Tris-HCl, 75 mM NaCl, 2.5 mM CaCl2, 10 mM cysteine, 1% DMSO after all additions...
Ligand InfoPC cidPC sid
In DepthDetails US Patent
TargetLys-gingipain W83(Porphyromonas gingivalis)
Cortexyme
US Patent
LigandPNGBDBM397433(US10676470, Compound 2 | US11332464, Compound 2 | ...)
Affinity DataIC50:  5.5nM. Assay description: The specific assay conditions were as follows. Buffer: pH=7.5, 100 mM Tris-HCl, 75 mM NaCl, 2.5 mM CaCl2, 10 mM cysteine, 1% DMSO after all additions...
Ligand InfoPC cidPC sid
In DepthDetails US Patent
TargetLys-gingipain(Porphyromonas gingivalis)
Cortexyme
US Patent
LigandPNGBDBM397433(US10676470, Compound 2 | US11332464, Compound 2 | ...)
Affinity DataIC50:  5.5nM. Assay description: Buffer: pH=7.5, 100 mM Tris-HCl, 75 mM NaCl, 2.5 mM CaCl2, 10 mM cysteine, 1% DMSO after all additions. Protein: 0.1 nM Kgp, isolated from culture of...
Ligand InfoPC cidPC sid
In DepthDetails US Patent
TargetLys-gingipain W83(Porphyromonas gingivalis)
Cortexyme
US Patent
LigandPNGBDBM397433(US10676470, Compound 2 | US11332464, Compound 2 | ...)
Affinity DataIC50:  5.5nM. Assay description: The capacities of compounds of the present invention to inhibit the activity of lysine gingipain were measured in a fluorogenic assay similar to thos...
Ligand InfoPC cidPC sid
In DepthDetails US Patent
TargetLys-gingipain(Porphyromonas gingivalis)
Cortexyme
US Patent
LigandPNGBDBM397433(US10676470, Compound 2 | US11332464, Compound 2 | ...)
Affinity DataIC50:  17.5nM. Assay description: Buffer: pH=7.5, 100 mM Tris-HCl, 75 mM NaCl, 2.5 mM CaCl2, 10 mM cysteine, 1% DMSO after all additions. Protein: 0.1 nM Kgp, isolated from culture of...
Ligand InfoPC cidPC sid
In DepthDetails US Patent
TargetLys-gingipain W83(Porphyromonas gingivalis)
Cortexyme
US Patent
LigandPNGBDBM397433(US10676470, Compound 2 | US11332464, Compound 2 | ...)
Affinity DataIC50:  17.5nM. Assay description: The capacities of compounds of the present invention to inhibit the activity of lysine gingipain were measured in a fluorogenic assay similar to thos...
Ligand InfoPC cidPC sid
In DepthDetails US Patent