BDBM397495 US9994525, Example 10
SMILES C[C@@H]1CCCN1CCCOc1ccc(OC2CCNCC2)cc1
InChI Key InChIKey=KAGNSPPVHSNARO-MRXNPFEDSA-N
Data  1 KI
  Tab Delimited (TSV)   2D SDfile   Computed 3D by Vconf -m prep SDfile
Find this compound or compounds like it in BindingDB:
Activity Spreadsheet -- Enzyme Inhibition Constant Data from BindingDB
Found 1 hit for monomerid = 397495
TargetHistamine H3 receptor(Rattus norvegicus (rat))
Richter Gedeon
US Patent
LigandPNGBDBM397495(US9994525, Example 10)
Affinity DataKi: <10nM. Assay description: Receptor binding assays were performed in at least 5 concentrations, with two parallel samples in each concentrations, in at least two independent ex...
Ligand InfoPC cidPC sid
In DepthDetails US Patent