BDBM397504 (3-{4-[(trans-2-Phenylcyclopropyl)amino]piperidin-1-yl}azetidin-3-yl)acetonitrile::US10676457, Example 3::US11155532, Example 3::US9994546, Example 3
SMILES N#CCC1(CNC1)N1CCC(CC1)NC1CC1c1ccccc1
InChI Key InChIKey=XVOKNSJVLHJVLS-UHFFFAOYSA-N
Data  3 IC50
  Tab Delimited (TSV)   2D SDfile   Computed 3D by Vconf -m prep SDfile
Find this compound or compounds like it in BindingDB:
Activity Spreadsheet -- Enzyme Inhibition Constant Data from BindingDB
Found 3 hits for monomerid = 397504
TargetLysine-specific histone demethylase 1A(Homo sapiens (Human))
Incyte
US Patent
LigandPNGBDBM397504((3-{4-[(trans-2-Phenylcyclopropyl)amino]piperidin-...)
Affinity DataIC50:  30nM. Assay description: LANCE LSD1/KDM1A demethylase assay 10 μL of 1 nM LSD-1 enzyme (ENZO BML-SE544-0050) in the assay buffer (50 mM Tris, pH 7.5, 0.01% Tween-20, 25 ...
Ligand InfoPC cidPC sid
In DepthDetails US Patent
TargetLysine-specific histone demethylase 1A(Homo sapiens (Human))
Incyte
US Patent
LigandPNGBDBM397504((3-{4-[(trans-2-Phenylcyclopropyl)amino]piperidin-...)
Affinity DataIC50: <100nM. Assay description: LANCE LSD1/KDM1A demethylase assay—10 μL of 1 nM LSD-1 enzyme (ENZO BML-SE544-0050) in the assay buffer (50 mM Tris, pH 7.5, 0.01% Tween-20, 25 ...
Ligand InfoPC cidPC sid
In DepthDetails US Patent
TargetLysine-specific histone demethylase 1A(Homo sapiens (Human))
Incyte
US Patent
LigandPNGBDBM397504((3-{4-[(trans-2-Phenylcyclopropyl)amino]piperidin-...)
Affinity DataIC50: <100nM. Assay description: LANCE LSD1/KDM1A demethylase assay—10 μL of 1 nM LSD-1 enzyme (ENZO BML-SE544-0050) in the assay buffer (50 mM Tris, pH 7.5, 0.01% Tween-20, 25 ...
Ligand InfoPC cidPC sid
In DepthDetails US Patent