BDBM397555 US10676457, Example 54::US11155532, Example 54::US9994546, Example 54::{1-[4-(methoxymethyl)-4-({[(1R,2S)-2-phenylcyclopropyl]amino}methyl)piperidin-1-yl]cyclobutyl}acetic acid
SMILES COCC1(CN[C@@H]2CC2c2ccccc2)CCN(CC1)C1(CC(O)=O)CCC1
InChI Key InChIKey=NYIWGYPPKJPGTJ-GFOWMXPYSA-N
Data  3 IC50
  Tab Delimited (TSV)   2D SDfile   Computed 3D by Vconf -m prep SDfile
Find this compound or compounds like it in BindingDB:
Activity Spreadsheet -- Enzyme Inhibition Constant Data from BindingDB
Found 3 hits for monomerid = 397555
TargetLysine-specific histone demethylase 1A(Homo sapiens (Human))
Incyte
US Patent
LigandPNGBDBM397555(US10676457, Example 54 | US11155532, Example 54 | ...)
Affinity DataIC50:  30nM. Assay description: LANCE LSD1/KDM1A demethylase assay 10 μL of 1 nM LSD-1 enzyme (ENZO BML-SE544-0050) in the assay buffer (50 mM Tris, pH 7.5, 0.01% Tween-20, 25 ...
Ligand InfoPC cidPC sid
In DepthDetails US Patent
TargetLysine-specific histone demethylase 1A(Homo sapiens (Human))
Incyte
US Patent
LigandPNGBDBM397555(US10676457, Example 54 | US11155532, Example 54 | ...)
Affinity DataIC50: <100nM. Assay description: LANCE LSD1/KDM1A demethylase assay—10 μL of 1 nM LSD-1 enzyme (ENZO BML-SE544-0050) in the assay buffer (50 mM Tris, pH 7.5, 0.01% Tween-20, 25 ...
Ligand InfoPC cidPC sid
In DepthDetails US Patent
TargetLysine-specific histone demethylase 1A(Homo sapiens (Human))
Incyte
US Patent
LigandPNGBDBM397555(US10676457, Example 54 | US11155532, Example 54 | ...)
Affinity DataIC50: <100nM. Assay description: LANCE LSD1/KDM1A demethylase assay—10 μL of 1 nM LSD-1 enzyme (ENZO BML-SE544-0050) in the assay buffer (50 mM Tris, pH 7.5, 0.01% Tween-20, 25 ...
Ligand InfoPC cidPC sid
In DepthDetails US Patent