BDBM397558 N-methyl-2-{1-[4-methyl-4-({[(1R,2S)-2-phenylcyclopropyl]amino}methyl)piperidin-1-yl]cyclobutyl}acetamide::US10676457, Example 57::US11155532, Example 57::US9994546, Example 57
SMILES CNC(=O)CC1(CCC1)N1CCC(C)(CN[C@@H]2CC2c2ccccc2)CC1
InChI Key InChIKey=CALXIMFKIFKIMQ-GFOWMXPYSA-N
Data  3 IC50
  Tab Delimited (TSV)   2D SDfile   Computed 3D by Vconf -m prep SDfile
Find this compound or compounds like it in BindingDB:
Activity Spreadsheet -- Enzyme Inhibition Constant Data from BindingDB
Found 3 hits for monomerid = 397558
TargetLysine-specific histone demethylase 1A(Homo sapiens (Human))
Incyte
US Patent
LigandPNGBDBM397558(N-methyl-2-{1-[4-methyl-4-({[(1R,2S)-2-phenylcyclo...)
Affinity DataIC50:  30nM. Assay description: LANCE LSD1/KDM1A demethylase assay 10 μL of 1 nM LSD-1 enzyme (ENZO BML-SE544-0050) in the assay buffer (50 mM Tris, pH 7.5, 0.01% Tween-20, 25 ...
Ligand InfoPC cidPC sid
In DepthDetails US Patent
TargetLysine-specific histone demethylase 1A(Homo sapiens (Human))
Incyte
US Patent
LigandPNGBDBM397558(N-methyl-2-{1-[4-methyl-4-({[(1R,2S)-2-phenylcyclo...)
Affinity DataIC50: <100nM. Assay description: LANCE LSD1/KDM1A demethylase assay—10 μL of 1 nM LSD-1 enzyme (ENZO BML-SE544-0050) in the assay buffer (50 mM Tris, pH 7.5, 0.01% Tween-20, 25 ...
Ligand InfoPC cidPC sid
In DepthDetails US Patent
TargetLysine-specific histone demethylase 1A(Homo sapiens (Human))
Incyte
US Patent
LigandPNGBDBM397558(N-methyl-2-{1-[4-methyl-4-({[(1R,2S)-2-phenylcyclo...)
Affinity DataIC50: <100nM. Assay description: LANCE LSD1/KDM1A demethylase assay—10 μL of 1 nM LSD-1 enzyme (ENZO BML-SE544-0050) in the assay buffer (50 mM Tris, pH 7.5, 0.01% Tween-20, 25 ...
Ligand InfoPC cidPC sid
In DepthDetails US Patent