BDBM397947 US10604536, Compound 19::US9994590, Compound 19
SMILES Cc1cnc(C)c2nc(nn12)C1CC1c1nc(cn1C)-c1ccccc1
InChI Key InChIKey=OONRDIVREIJHLU-UHFFFAOYSA-N
Data  2 IC50
  Tab Delimited (TSV)   2D SDfile   Computed 3D by Vconf -m prep SDfile
Find this compound or compounds like it in BindingDB:
Activity Spreadsheet -- Enzyme Inhibition Constant Data from BindingDB
Found 2 hits for monomerid = 397947
TargetcAMP and cAMP-inhibited cGMP 3',5'-cyclic phosphodiesterase 10A(Homo sapiens (Human))
Sunovion Pharamaceuticals
US Patent
LigandPNGBDBM397947(US10604536, Compound 19 | US9994590, Compound 19)
Affinity DataIC50:  55nM. Assay description: The compounds were determined using the Molecular Devices IMAP PDE Fluorescence Polarization assay using recombinant human PDE-10 enzyme expressed in...
Ligand InfoPC cidPC sid
In DepthDetails US Patent
TargetcAMP and cAMP-inhibited cGMP 3',5'-cyclic phosphodiesterase 10A(Homo sapiens (Human))
Sunovion Pharamaceuticals
US Patent
LigandPNGBDBM397947(US10604536, Compound 19 | US9994590, Compound 19)
Affinity DataIC50:  55nM. Assay description: In one embodiment, the compounds provided herein were assayed for their ability to inhibit human PDE-10A. In one embodiment, the activities of the co...
Ligand InfoPC cidPC sid
In DepthDetails US Patent