BDBM3980 2,2 -Dithiobis(1-methyl-1H-indole-3-propanoic acid)::3-(2-{[3-(2-carboxyethyl)-1-methyl-1H-indol-2-yl]disulfanyl}-1-methyl-1H-indol-3-yl)propanoic acid::dithiobis(1H-indole-3-alkanoic acid) deriv. 28
SMILES Cn1c(SSc2c(CCC(O)=O)c3ccccc3n2C)c(CCC(O)=O)c2ccccc12
InChI Key InChIKey=YEQMSCNOXHUWHS-UHFFFAOYSA-N
Data  1 IC50
  Tab Delimited (TSV)   2D SDfile   Computed 3D by Vconf -m prep SDfile
Find this compound or compounds like it in BindingDB:
Activity Spreadsheet -- Enzyme Inhibition Constant Data from BindingDB
Found 1 hit for monomerid = 3980
TargetEpidermal growth factor receptor(Homo sapiens (Human))
University Of Auckland
LigandPNGBDBM3980(2,2 -Dithiobis(1-methyl-1H-indole-3-propanoic acid...)
Affinity DataIC50:  3.10E+3nM. Assay description: IC50 is the inhibitor concentration which inhibits 50% of kinase activity that catalyzes the transfer of the terminal phosphate from [gamma-32P] labe...
In DepthDetails ArticlePubMed