BDBM398018 US10322108, Example 18B
SMILES OC(=O)c1ccc(cc1)N1C(=O)\C(=C\c2c(F)cccc2F)c2c1cccc2F
InChI Key InChIKey=ZFTCBJPTZNCFHQ-RVDMUPIBSA-N
Data  1 IC50
  Tab Delimited (TSV)   2D SDfile   Computed 3D by Vconf -m prep SDfile
Find this compound or compounds like it in BindingDB:
Activity Spreadsheet -- Enzyme Inhibition Constant Data from BindingDB
Found 1 hit for monomerid = 398018
TargetNuclear receptor ROR-gamma(Homo sapiens (Human))
Beijing Hanmi Pharmaceutical
US Patent
LigandPNGBDBM398018(US10322108, Example 18B)
Affinity DataIC50:  5.50E+3nM. Assay description: The compounds of the present application can regulate (inhibit) the biological activity of the nuclear receptor RORγ, and the intensity of such ...
Ligand InfoPC cidPC sid
In DepthDetails US Patent