BDBM398026 US10322108, Example 22B
SMILES OC(=O)c1ccc(cc1O)N1C(=O)\C(=C\c2c(Cl)cccc2Cl)c2c1cccc2F
InChI Key InChIKey=SONHGEIXJMOQIZ-GXDHUFHOSA-N
Data  1 IC50
  Tab Delimited (TSV)   2D SDfile   Computed 3D by Vconf -m prep SDfile
Find this compound or compounds like it in BindingDB:
Activity Spreadsheet -- Enzyme Inhibition Constant Data from BindingDB
Found 1 hit for monomerid = 398026
TargetNuclear receptor ROR-gamma(Homo sapiens (Human))
Beijing Hanmi Pharmaceutical
US Patent
LigandPNGBDBM398026(US10322108, Example 22B)
Affinity DataIC50: <100nM. Assay description: The compounds of the present application can regulate (inhibit) the biological activity of the nuclear receptor RORγ, and the intensity of such ...
Ligand InfoPC cidPC sid
In DepthDetails US Patent