BDBM398029 US10322108, Example 25
SMILES Cc1cccc2N(C(=O)\C(=C/c3c(Cl)cccc3C3CC3)c12)c1ccc(C(O)=O)c(F)c1
InChI Key InChIKey=GKEWYKSGMSNWAO-MOSHPQCFSA-N
Data  1 IC50
  Tab Delimited (TSV)   2D SDfile   Computed 3D by Vconf -m prep SDfile
Find this compound or compounds like it in BindingDB:
Activity Spreadsheet -- Enzyme Inhibition Constant Data from BindingDB
Found 1 hit for monomerid = 398029
TargetNuclear receptor ROR-gamma(Homo sapiens (Human))
Beijing Hanmi Pharmaceutical
US Patent
LigandPNGBDBM398029(US10322108, Example 25)
Affinity DataIC50:  550nM. Assay description: The compounds of the present application can regulate (inhibit) the biological activity of the nuclear receptor RORγ, and the intensity of such ...
Ligand InfoPC cidPC sid
In DepthDetails US Patent