BDBM398035 US10322108, Example 31
SMILES COc1cccc2N(C(=O)\C(=C/c3c(Cl)cccc3Cl)c12)c1ccc(cc1)C(O)=O
InChI Key InChIKey=DMESYGORHKELLW-VBKFSLOCSA-N
Data  1 IC50
  Tab Delimited (TSV)   2D SDfile   Computed 3D by Vconf -m prep SDfile
Find this compound or compounds like it in BindingDB:
Activity Spreadsheet -- Enzyme Inhibition Constant Data from BindingDB
Found 1 hit for monomerid = 398035
TargetNuclear receptor ROR-gamma(Homo sapiens (Human))
Beijing Hanmi Pharmaceutical
US Patent
LigandPNGBDBM398035(US10322108, Example 31)
Affinity DataIC50:  5.50E+3nM. Assay description: The compounds of the present application can regulate (inhibit) the biological activity of the nuclear receptor RORγ, and the intensity of such ...
Ligand InfoPC cidPC sid
In DepthDetails US Patent