BDBM398204 4-chloro-N-((3,3-difluoro-5-(trifluoromethyl)cyclo-hexyl)methyl)-1-((tetrahydrofuran-2-yl)methyl)-1H-indole-3-carboxamide::US10323000, Compound 141::US10676433, Compound 141
SMILES FC(F)(F)C1CC(CNC(=O)c2cn(CC3CCCO3)c3cccc(Cl)c23)CC(F)(F)C1
InChI Key InChIKey=ZWUQOCKDABZQOW-UHFFFAOYSA-N
Data  4 IC50
  Tab Delimited (TSV)   2D SDfile   Computed 3D by Vconf -m prep SDfile
Find this compound or compounds like it in BindingDB:
Activity Spreadsheet -- Enzyme Inhibition Constant Data from BindingDB
Found 4 hits for monomerid = 398204
TargetP2X purinoceptor 7(Homo sapiens (Human))
Merck Patent
US Patent
LigandPNGBDBM398204(4-chloro-N-((3,3-difluoro-5-(trifluoromethyl)cyclo...)
Affinity DataIC50:  55nM. Assay description: Agonist-induced pore formation was determined by measuring cellular uptake of YO PRO fluorescence dye in HEK293 transfected with human P2X7 receptor....
Ligand InfoPC cidPC sid
In DepthDetails US Patent
TargetInterleukin-1 beta(Homo sapiens (Human))
Merck Patent
US Patent
LigandPNGBDBM398204(4-chloro-N-((3,3-difluoro-5-(trifluoromethyl)cyclo...)
Affinity DataIC50:  55nM. Assay description: The activation of P2X7 by ATP leads to a fast transient activation of cells resulting in influx of Ca2+ followed by conversion of pro-IL-1β to a...
Ligand InfoPC cidPC sid
In DepthDetails US Patent
TargetP2X purinoceptor 7(Homo sapiens (Human))
Merck Patent
US Patent
LigandPNGBDBM398204(4-chloro-N-((3,3-difluoro-5-(trifluoromethyl)cyclo...)
Affinity DataIC50:  55nM. Assay description: Agonist-induced pore formation was determined by measuring cellular uptake of YO PRO fluorescence dye in HEK293 transfected with human P2X7 receptor....
Ligand InfoPC cidPC sid
In DepthDetails US Patent
TargetInterleukin-1 beta(Homo sapiens (Human))
Merck Patent
US Patent
LigandPNGBDBM398204(4-chloro-N-((3,3-difluoro-5-(trifluoromethyl)cyclo...)
Affinity DataIC50:  55nM. Assay description: The activation of P2X7 by ATP leads to a fast transient activation of cells resulting in influx of Ca2+ followed by conversion of pro-IL-1β to a...
Ligand InfoPC cidPC sid
In DepthDetails US Patent