BDBM398786 US10323022, Example 263
SMILES CCOc1nn(c(NC(=O)N[C@@H]2CN(C[C@H]2c2ccc(F)c(F)c2)C(CO)COC)c1C)-c1ccccc1
InChI Key InChIKey=ZCARMPKWOGYMCA-UFGQEVIHSA-N
Data  1 IC50
  Tab Delimited (TSV)   2D SDfile   Computed 3D by Vconf -m prep SDfile
Find this compound or compounds like it in BindingDB:
Activity Spreadsheet -- Enzyme Inhibition Constant Data from BindingDB
Found 1 hit for monomerid = 398786
TargetHigh affinity nerve growth factor receptor(Homo sapiens (Human))
Array Biopharma
US Patent
LigandPNGBDBM398786(US10323022, Example 263)
Affinity DataIC50: <100nM. Assay description: Trk enzymatic selectivity was assessed using Omnia Kinase Assay reagents from Invitrogen Corp. Enzyme (TrkA from Invitrogen Corp.) and test compound ...
Ligand InfoPC cidPC sid
In DepthDetails US Patent