BDBM3991 1 H-indole-3-alkanamide deriv. 10b::2-(2-{[3-(cyanomethyl)-1H-indol-2-yl]disulfanyl}-1H-indol-3-yl)acetonitrile
SMILES N#CCc1c(SSc2[nH]c3ccccc3c2CC#N)[nH]c2ccccc12
InChI Key InChIKey=WRQVNXDOWPRYHH-UHFFFAOYSA-N
Data  2 IC50
  Tab Delimited (TSV)   2D SDfile   Computed 3D by Vconf -m prep SDfile
Find this compound or compounds like it in BindingDB:
Activity Spreadsheet -- Enzyme Inhibition Constant Data from BindingDB
Found 2 hits for monomerid = 3991
TargetTyrosine-protein kinase transforming protein Src(Avian sarcoma virus)
University Of Auckland
LigandPNGBDBM3991(1 H-indole-3-alkanamide deriv. 10b | 2-(2-{[3-(cya...)
Affinity DataIC50:  2.50E+3nM. Assay description: IC50 is the inhibitor concentration which inhibits 50% of kinase activity that catalyzes the transfer of the terminal phosphate from [gamma-32P] labe...
In DepthDetails ArticlePubMed
TargetEpidermal growth factor receptor(Homo sapiens (Human))
University Of Auckland
LigandPNGBDBM3991(1 H-indole-3-alkanamide deriv. 10b | 2-(2-{[3-(cya...)
Affinity DataIC50:  3.20E+4nMpH: 7.4 T: 2°C. Assay description: IC50 is the inhibitor concentration which inhibits 50% of kinase activity that catalyzes the transfer of the terminal phosphate from [gamma-32P] labe...
In DepthDetails ArticlePubMed