BDBM399161 1-((3S,4R)-4-(3,4- difluorophenyl)-1-(2- methoxyethyl)pyrrolidin-3- yl)-3-(5-methyl-3-phenyl-1- (pyrazin-2-yl)-1H-pyrazol-4- yl)urea::US10323022, Example 638
SMILES COCCN1C[C@@H](NC(=O)Nc2c(C)n(nc2-c2ccccc2)-c2cnccn2)[C@@H](C1)c1ccc(F)c(F)c1
InChI Key InChIKey=KUSVTESUNBYOGM-XUZZJYLKSA-N
Data  1 IC50
  Tab Delimited (TSV)   2D SDfile   Computed 3D by Vconf -m prep SDfile
Find this compound or compounds like it in BindingDB:
Activity Spreadsheet -- Enzyme Inhibition Constant Data from BindingDB
Found 1 hit for monomerid = 399161
TargetHigh affinity nerve growth factor receptor(Homo sapiens (Human))
Array Biopharma
US Patent
LigandPNGBDBM399161(1-((3S,4R)-4-(3,4- difluorophenyl)-1-(2- methoxyet...)
Affinity DataIC50: <100nM. Assay description: Trk enzymatic selectivity was assessed using Omnia Kinase Assay reagents from Invitrogen Corp. Enzyme (TrkA from Invitrogen Corp.) and test compound ...
Ligand InfoPC cidPC sid
In DepthDetails US Patent