BDBM399173 US10323023, Compound TDI01164::US11390609, Compound TDI01164
SMILES O=C(Nc1ccnnc1)c1cc2ccc(cc2[nH]1)-c1nc(Nc2ccc3[nH]ncc3c2)cc2nccn12
InChI Key InChIKey=XXSOHYWBZWXPQQ-UHFFFAOYSA-N
Data  4 IC50
  Tab Delimited (TSV)   2D SDfile   Computed 3D by Vconf -m prep SDfile
Find this compound or compounds like it in BindingDB:
Activity Spreadsheet -- Enzyme Inhibition Constant Data from BindingDB
Found 4 hits for monomerid = 399173
TargetRho-associated protein kinase 2(Homo sapiens (Human))
Beijing Tide Pharmaceutical
US Patent
LigandPNGBDBM399173(US10323023, Compound TDI01164 | US11390609, Compou...)
Affinity DataIC50:  438nM. Assay description: The kinase IC50 was determined by a commercialized CISBIO kinase detection kit, HTRF KinEASE-STK S2 kit (62ST2PEC). ROCK2 (01-119) employed in the re...
Ligand InfoPC cidPC sid
In DepthDetails US Patent
TargetRho-associated protein kinase 2(Homo sapiens (Human))
Beijing Tide Pharmaceutical
US Patent
LigandPNGBDBM399173(US10323023, Compound TDI01164 | US11390609, Compou...)
Affinity DataIC50:  438nM. Assay description: The kinase IC50 was determined by a commercialized CISBIO kinase detection kit, HTRF KinEASE-STK S2 kit (62ST2PEC). ROCK2 (01-119) employed in the re...
Ligand InfoPC cidPC sid
In DepthDetails US Patent
TargetRho-associated protein kinase 1(Homo sapiens (Human))
Beijing Tide Pharmaceutical
US Patent
LigandPNGBDBM399173(US10323023, Compound TDI01164 | US11390609, Compou...)
Affinity DataIC50: >1.00E+4nM. Assay description: The kinase IC50 was determined by a commercialized CISBIO kinase detection kit, HTRF KinEASE-STK S2 kit (62ST2PEC). ROCK2 (01-119) employed in the re...
Ligand InfoPC cidPC sid
In DepthDetails US Patent
TargetRho-associated protein kinase 2 [1-119](Homo sapiens (Human))
Beijing Tide Pharmaceutical
US Patent
LigandPNGBDBM399173(US10323023, Compound TDI01164 | US11390609, Compou...)
Affinity DataIC50:  438nM. Assay description: The kinase IC50 was determined by a commercialized CISBIO kinase detection kit, HTRF KinEASE-STK S2 kit (62ST2PEC). ROCK2 (01-119) employed in the re...
Ligand InfoPC cidPC sid
In DepthDetails US Patent