BDBM399597 US10323036, Compound I-41::US10793574, Compound I-41
SMILES COc1c(Nc2cc(Nc3ccc(cn3)C#N)nc3[nH]n(C)c(=O)c23)cccc1C#N
InChI Key InChIKey=QFXRIGGWBQSAJP-UHFFFAOYSA-N
Data  2 Kd
  Tab Delimited (TSV)   2D SDfile   Computed 3D by Vconf -m prep SDfile
Find this compound or compounds like it in BindingDB:
Activity Spreadsheet -- Enzyme Inhibition Constant Data from BindingDB
Found 2 hits for monomerid = 399597
TargetNon-receptor tyrosine-protein kinase TYK2 [556-888](Homo sapiens (Human))
Nimbus Lakshmi
US Patent
LigandPNGBDBM399597(US10323036, Compound I-41 | US10793574, Compound I...)
Affinity DataKd: >10nM. Assay description: Binding constants for compounds of the present invention against the JH2 domain were determined by the following protocol for a KINOMEscan® assay (Di...
Ligand InfoPC cidPC sid
In DepthDetails US Patent
TargetNon-receptor tyrosine-protein kinase TYK2 [V731I](Homo sapiens (Human))
Nimbus Lakshmi
US Patent
LigandPNGBDBM399597(US10323036, Compound I-41 | US10793574, Compound I...)
Affinity DataKd: >10nM. Assay description: Binding constants for compounds of the present invention against the JH2 domain were determined by the following protocol for a KINOMEscan® assay (Di...
Ligand InfoPC cidPC sid
In DepthDetails US Patent