BDBM399852 N-(1-(cis-5-((5-chloro-2- (trifluoromethyl)benzyl)(methyl)amino) octahydrocyclopenta[c]pyrrole-2- carbonyl)-1H-pyrazol-4-yl)-N- methylacetamide::US10323038, Example 161
SMILES CN(Cc1cc(Cl)ccc1C(F)(F)F)[C@H]1C[C@H]2CN(C[C@H]2C1)C(=O)n1cc(cn1)N(C)C(C)=O
InChI Key InChIKey=UIAADNLXFZNJKG-HGKCTWBKSA-N
Data  2 IC50
  Tab Delimited (TSV)   2D SDfile   Computed 3D by Vconf -m prep SDfile
Find this compound or compounds like it in BindingDB:
Activity Spreadsheet -- Enzyme Inhibition Constant Data from BindingDB
Found 2 hits for monomerid = 399852
TargetMonoglyceride lipase(Mus musculus (mouse))
Abide Therapeutics
US Patent
LigandPNGBDBM399852(N-(1-(cis-5-((5-chloro-2- (trifluoromethyl)benzyl)...)
Affinity DataIC50: <100nM. Assay description: Proteomes (mouse brain membrane fraction or cell lysates for mouse assays; human prefrontal cortex or cell membrane fractions for human assays) (50 &...
Ligand InfoPC cidPC sid
In DepthDetails US Patent
TargetFatty-acid amide hydrolase 1(Mus musculus (mouse))
Abide Therapeutics
US Patent
LigandPNGBDBM399852(N-(1-(cis-5-((5-chloro-2- (trifluoromethyl)benzyl)...)
Affinity DataIC50: <100nM. Assay description: Proteomes (mouse brain membrane fraction or cell lysates for mouse assays; human prefrontal cortex or cell membrane fractions for human assays) (50 &...
Ligand InfoPC cidPC sid
In DepthDetails US Patent