BDBM399872 N-(1-(4-(3,4-dichlorobenzyl)piperazine- 1-carbonyl)-1H-pyrazol-4-yl)-N- methylacetamide::US10323038, Example 196
SMILES CN(C(C)=O)c1cnn(c1)C(=O)N1CCN(Cc2ccc(Cl)c(Cl)c2)CC1
InChI Key InChIKey=URCZUDRMHSLNJV-UHFFFAOYSA-N
Data  2 IC50
  Tab Delimited (TSV)   2D SDfile   Computed 3D by Vconf -m prep SDfile
Find this compound or compounds like it in BindingDB:
Activity Spreadsheet -- Enzyme Inhibition Constant Data from BindingDB
Found 2 hits for monomerid = 399872
TargetMonoglyceride lipase(Mus musculus (mouse))
Abide Therapeutics
US Patent
LigandPNGBDBM399872(N-(1-(4-(3,4-dichlorobenzyl)piperazine- 1-carbonyl...)
Affinity DataIC50: <100nM. Assay description: Proteomes (mouse brain membrane fraction or cell lysates for mouse assays; human prefrontal cortex or cell membrane fractions for human assays) (50 &...
Ligand InfoPC cidPC sid
In DepthDetails US Patent
TargetFatty-acid amide hydrolase 1(Mus musculus (mouse))
Abide Therapeutics
US Patent
LigandPNGBDBM399872(N-(1-(4-(3,4-dichlorobenzyl)piperazine- 1-carbonyl...)
Affinity DataIC50:  550nM. Assay description: Proteomes (mouse brain membrane fraction or cell lysates for mouse assays; human prefrontal cortex or cell membrane fractions for human assays) (50 &...
Ligand InfoPC cidPC sid
In DepthDetails US Patent