BDBM399898 N-methyl-N-(1-(7-(3-phenoxybenzyl)- 2,7-diazaspiro[4.4]nonane-2-carbonyl)- 1H-pyrazol-4-yl)acetamide::US10323038, Example 236
SMILES CN(C(C)=O)c1cnn(c1)C(=O)N1CCC2(CCN(Cc3cccc(Oc4ccccc4)c3)C2)C1
InChI Key InChIKey=PEOMXGSLEJHFOF-UHFFFAOYSA-N
Data  2 IC50
  Tab Delimited (TSV)   2D SDfile   Computed 3D by Vconf -m prep SDfile
Find this compound or compounds like it in BindingDB:
Activity Spreadsheet -- Enzyme Inhibition Constant Data from BindingDB
Found 2 hits for monomerid = 399898
TargetMonoglyceride lipase(Mus musculus (mouse))
Abide Therapeutics
US Patent
LigandPNGBDBM399898(N-methyl-N-(1-(7-(3-phenoxybenzyl)- 2,7-diazaspiro...)
Affinity DataIC50:  550nM. Assay description: Proteomes (mouse brain membrane fraction or cell lysates for mouse assays; human prefrontal cortex or cell membrane fractions for human assays) (50 &...
Ligand InfoPC cidPC sid
In DepthDetails US Patent
TargetFatty-acid amide hydrolase 1(Mus musculus (mouse))
Abide Therapeutics
US Patent
LigandPNGBDBM399898(N-methyl-N-(1-(7-(3-phenoxybenzyl)- 2,7-diazaspiro...)
Affinity DataIC50: <100nM. Assay description: Proteomes (mouse brain membrane fraction or cell lysates for mouse assays; human prefrontal cortex or cell membrane fractions for human assays) (50 &...
Ligand InfoPC cidPC sid
In DepthDetails US Patent