BDBM399920 N-(1-(4-(4-(oxazol-2-yl)-2- (trifluoromethyl)benzy)piperazine-1- carbonyl)-1H-pyrazol-4- yl)methanesulfonamide::US10323038, Example 303
SMILES CS(=O)(=O)Nc1cnn(c1)C(=O)N1CCN(Cc2ccc(cc2C(F)(F)F)-c2ncco2)CC1
InChI Key InChIKey=WFRRMWAWFQVXRD-UHFFFAOYSA-N
Data  2 IC50
  Tab Delimited (TSV)   2D SDfile   Computed 3D by Vconf -m prep SDfile
Find this compound or compounds like it in BindingDB:
Activity Spreadsheet -- Enzyme Inhibition Constant Data from BindingDB
Found 2 hits for monomerid = 399920
TargetMonoglyceride lipase(Mus musculus (mouse))
Abide Therapeutics
US Patent
LigandPNGBDBM399920(N-(1-(4-(4-(oxazol-2-yl)-2- (trifluoromethyl)benzy...)
Affinity DataIC50: <100nM. Assay description: Proteomes (mouse brain membrane fraction or cell lysates for mouse assays; human prefrontal cortex or cell membrane fractions for human assays) (50 &...
Ligand InfoPC cidPC sid
In DepthDetails US Patent
TargetFatty-acid amide hydrolase 1(Mus musculus (mouse))
Abide Therapeutics
US Patent
LigandPNGBDBM399920(N-(1-(4-(4-(oxazol-2-yl)-2- (trifluoromethyl)benzy...)
Affinity DataIC50:  5.50E+3nM. Assay description: Proteomes (mouse brain membrane fraction or cell lysates for mouse assays; human prefrontal cortex or cell membrane fractions for human assays) (50 &...
Ligand InfoPC cidPC sid
In DepthDetails US Patent