BDBM400032 N-(3-chloro-4-fluorophenyl)-7-(2-((3,3-difluoro-1-(6-oxa-1-azaspiro[3.3]heptane-1-carbonyl)cyclobutyl)amino)-2-oxoacetyl)-6-methyl-2,3-dihydro-1H-pyrrolizine-5-carboxamide ::US10328053, Compound 11::US10874640, Compound 11::US20230270719, Compound 11
SMILES Cc1c(C(=O)C(=O)NC2(CC(F)(F)C2)C(=O)N2CCC22COC2)c2CCCn2c1C(=O)Nc1ccc(F)c(Cl)c1
InChI Key InChIKey=UYKIORIKGHOKHM-UHFFFAOYSA-N
Data  3 EC50
  Tab Delimited (TSV)   2D SDfile   Computed 3D by Vconf -m prep SDfile
Find this compound or compounds like it in BindingDB:
Activity Spreadsheet -- Enzyme Inhibition Constant Data from BindingDB
Found 3 hits for monomerid = 400032
TargetSodium/bile acid cotransporter(Homo sapiens (Human))
Gilead Sciences
US Patent
LigandPNGBDBM400032(N-(3-chloro-4-fluorophenyl)-7-(2-((3,3-difluoro-1-...)
Affinity DataEC50:  7.70nM. Assay description: A HepG2 cell line overexpressing the HBV virus attachment receptor sodium-taurocholate cotransporting polypeptide (NTCP) was grown to confluency in D...
Ligand InfoPC cidPC sid
In DepthDetails US Patent
TargetSodium/bile acid cotransporter(Homo sapiens (Human))
Gilead Sciences
US Patent
LigandPNGBDBM400032(N-(3-chloro-4-fluorophenyl)-7-(2-((3,3-difluoro-1-...)
Affinity DataEC50:  7.70nM. Assay description: A HepG2 cell line overexpressing the HBV virus attachment receptor sodium-taurocholate cotransporting polypeptide (NTCP) was grown to confluency in D...
Ligand InfoPC cidPC sid
In DepthDetails US Patent
TargetCapsid protein(Hepatitis B virus genotype C subtype ayr (isolate ...)
Gilead Sciences
US Patent
LigandPNGBDBM400032(N-(3-chloro-4-fluorophenyl)-7-(2-((3,3-difluoro-1-...)
Affinity DataEC50:  7.70nM. Assay description: A HepG2 cell line overexpressing the HBV virus attachment receptor sodium-taurocholate cotransporting polypeptide (NTCP) was grown to confluency in D...
Ligand InfoPC cidPC sid
In DepthDetails US Patent