BDBM400148 (R)-N-(3-Chloro-4-fluorophenyl)-6-methyl-7-(2-oxo-2-((1,1,1-trifluoro-3-hydroxy-2-methylpropan-2-yl)amino)acetyl)-2,3-dihydro-1H-pyrrolizine-5-carboxamide::US10328053, Compound 132::US10874640, Compound 132::US20230270719, Compound 132
SMILES Cc1c(C(=O)C(=O)NC(C)(CO)C(F)(F)F)c2CCCn2c1C(=O)Nc1ccc(F)c(Cl)c1
InChI Key InChIKey=NECWSEGWRSPEFD-UHFFFAOYSA-N
Data  3 EC50
  Tab Delimited (TSV)   2D SDfile   Computed 3D by Vconf -m prep SDfile
Find this compound or compounds like it in BindingDB:
Activity Spreadsheet -- Enzyme Inhibition Constant Data from BindingDB
Found 3 hits for monomerid = 400148
TargetSodium/bile acid cotransporter(Homo sapiens (Human))
Gilead Sciences
US Patent
LigandPNGBDBM400148((R)-N-(3-Chloro-4-fluorophenyl)-6-methyl-7-(2-oxo-...)
Affinity DataEC50:  8.30nM. Assay description: A HepG2 cell line overexpressing the HBV virus attachment receptor sodium-taurocholate cotransporting polypeptide (NTCP) was grown to confluency in D...
Ligand InfoPC cidPC sid
In DepthDetails US Patent
TargetSodium/bile acid cotransporter(Homo sapiens (Human))
Gilead Sciences
US Patent
LigandPNGBDBM400148((R)-N-(3-Chloro-4-fluorophenyl)-6-methyl-7-(2-oxo-...)
Affinity DataEC50:  8.30nM. Assay description: A HepG2 cell line overexpressing the HBV virus attachment receptor sodium-taurocholate cotransporting polypeptide (NTCP) was grown to confluency in D...
Ligand InfoPC cidPC sid
In DepthDetails US Patent
TargetCapsid protein(Hepatitis B virus genotype C subtype ayr (isolate ...)
Gilead Sciences
US Patent
LigandPNGBDBM400148((R)-N-(3-Chloro-4-fluorophenyl)-6-methyl-7-(2-oxo-...)
Affinity DataEC50:  8.30nM. Assay description: A HepG2 cell line overexpressing the HBV virus attachment receptor sodium-taurocholate cotransporting polypeptide (NTCP) was grown to confluency in D...
Ligand InfoPC cidPC sid
In DepthDetails US Patent