BDBM400180 US10328054, Example Compound 23
SMILES N#Cc1ccnc(c1)N1CC2CC2(C1)C#Cc1ccccn1
InChI Key InChIKey=XYZWHNNWYMUKOW-UHFFFAOYSA-N
Data  1 IC50
  Tab Delimited (TSV)   2D SDfile   Computed 3D by Vconf -m prep SDfile
Find this compound or compounds like it in BindingDB:
Activity Spreadsheet -- Enzyme Inhibition Constant Data from BindingDB
Found 1 hit for monomerid = 400180
TargetMetabotropic glutamate receptor 5(Rattus norvegicus (Rat))
Hua Medicine (Shanghai)
US Patent
LigandPNGBDBM400180(US10328054, Example Compound 23)
Affinity DataIC50: <500nM. Assay description: For functional assays, HEK293 cells stably expressing recombinant rat mGluR5 were seeded in 384-well plates and dye loaded using Fluo-8. Cells were t...
Ligand InfoPC cidPC sid
In DepthDetails US Patent