BDBM400210 US10328054, Example Compound 61
SMILES Clc1cccc(c1)C(=O)N1CC2CC2(C1)C#Cc1ncccn1
InChI Key InChIKey=ZGWFIZXNWYZIIW-UHFFFAOYSA-N
Data  1 IC50
  Tab Delimited (TSV)   2D SDfile   Computed 3D by Vconf -m prep SDfile
Find this compound or compounds like it in BindingDB:
Activity Spreadsheet -- Enzyme Inhibition Constant Data from BindingDB
Found 1 hit for monomerid = 400210
TargetMetabotropic glutamate receptor 5(Rattus norvegicus (Rat))
Hua Medicine (Shanghai)
US Patent
LigandPNGBDBM400210(US10328054, Example Compound 61)
Affinity DataIC50:  750nM. Assay description: For functional assays, HEK293 cells stably expressing recombinant rat mGluR5 were seeded in 384-well plates and dye loaded using Fluo-8. Cells were t...
Ligand InfoPC cidPC sid
In DepthDetails US Patent