BDBM400234 7-((1-(Cyclopropylmethyl)-1H-imidazo[4,5-b]pyrazin-6-yl)amino)-4-methyl-2H-benzo[b][1,4]oxazin-3(4H)-one::US10016439, 42
SMILES CN1C(=O)COc2cc(Nc3cnc4ncn(CC5CC5)c4n3)ccc12
InChI Key InChIKey=DQVPGUMCHCVJJC-UHFFFAOYSA-N
Data  1 KI
  Tab Delimited (TSV)   2D SDfile   Computed 3D by Vconf -m prep SDfile
Find this compound or compounds like it in BindingDB:
Activity Spreadsheet -- Enzyme Inhibition Constant Data from BindingDB
Found 1 hit for monomerid = 400234
TargetGamma-aminobutyric acid receptor subunit alpha-5(Homo sapiens (Human))
Ono Pharmaceutical
US Patent
LigandPNGBDBM400234(7-((1-(Cyclopropylmethyl)-1H-imidazo[4,5-b]pyrazin...)
Affinity DataKi:  24nM. Assay description: The GABAAα5/β3/γ2 protein used for the Scintillation Proximity Assay was derived from membranes produced from HEK293 GABAA α5/ ...
Ligand InfoPC cidPC sid
In DepthDetails US Patent