BDBM400687 US10000476, Compound I-46
SMILES O=C1NC(=O)C(Cn2ccccc2=O)(N1)c1ccccc1
InChI Key InChIKey=SUAPILKFPJJQMA-UHFFFAOYSA-N
Data  1 IC50
  Tab Delimited (TSV)   2D SDfile   Computed 3D by Vconf -m prep SDfile
Find this compound or compounds like it in BindingDB:
Activity Spreadsheet -- Enzyme Inhibition Constant Data from BindingDB
Found 1 hit for monomerid = 400687
TargetDisintegrin and metalloproteinase domain-containing protein 17(Homo sapiens (Human))
Kaken Pharmaceutical
US Patent
LigandPNGBDBM400687(US10000476, Compound I-46)
Affinity DataIC50: <100nM. Assay description: The TACE inhibition test was carried out by measuring TACE activity in the presence and the absence of the test substance using the thus-obtained TAC...
Ligand InfoPC cidPC sid
In DepthDetails US Patent