BDBM400757 US10000476, Compound I-116
SMILES CCc1ccc(cc1)C1(Cn2cccc(C)c2=O)NC(=O)NC1=O
InChI Key InChIKey=IBMTZACWLMLVOT-UHFFFAOYSA-N
Data  1 IC50
  Tab Delimited (TSV)   2D SDfile   Computed 3D by Vconf -m prep SDfile
Find this compound or compounds like it in BindingDB:
Activity Spreadsheet -- Enzyme Inhibition Constant Data from BindingDB
Found 1 hit for monomerid = 400757
TargetDisintegrin and metalloproteinase domain-containing protein 17(Homo sapiens (Human))
Kaken Pharmaceutical
US Patent
LigandPNGBDBM400757(US10000476, Compound I-116)
Affinity DataIC50: <100nM. Assay description: The TACE inhibition test was carried out by measuring TACE activity in the presence and the absence of the test substance using the thus-obtained TAC...
Ligand InfoPC cidPC sid
In DepthDetails US Patent