BDBM400941 2-Amino-N-{4-[(3S,5R)-3-amino-5-(trifluoromethyl)piperidin-1-yl]pyridin-3-yl}-6-[(4-methoxypiperidin-1-yl)methyl]furo[3,2-b]pyridine-3-carboxamide::US10000507, Example 107
SMILES COC1CCN(Cc2cnc3c(C(=O)Nc4cnccc4N4C[C@@H](N)C[C@H](C4)C(F)(F)F)c(N)oc3c2)CC1
InChI Key InChIKey=YXALFOJQKBGSHN-SJORKVTESA-N
Data  3 IC50
  Tab Delimited (TSV)   2D SDfile   Computed 3D by Vconf -m prep SDfile
Find this compound or compounds like it in BindingDB:
Activity Spreadsheet -- Enzyme Inhibition Constant Data from BindingDB
Found 3 hits for monomerid = 400941
TargetSerine/threonine-protein kinase pim-1(Homo sapiens (Human))
Incyte
US Patent
LigandPNGBDBM400941(2-Amino-N-{4-[(3S,5R)-3-amino-5-(trifluoromethyl)p...)
Affinity DataIC50: <10nM. Assay description: Pim-1 and Pim-3 kinase assays-20 μL reactions were run in white 384 well polystyrene plates dotted with 0.8 μL compound/DMSO in the assay b...
Ligand InfoPC cidPC sid
In DepthDetails US Patent
TargetSerine/threonine-protein kinase pim-3(Homo sapiens (Human))
Incyte
US Patent
LigandPNGBDBM400941(2-Amino-N-{4-[(3S,5R)-3-amino-5-(trifluoromethyl)p...)
Affinity DataIC50: <10nM. Assay description: Pim-1 and Pim-3 kinase assays-20 μL reactions were run in white 384 well polystyrene plates dotted with 0.8 μL compound/DMSO in the assay b...
Ligand InfoPC cidPC sid
In DepthDetails US Patent
TargetSerine/threonine-protein kinase pim-2(Homo sapiens (Human))
Incyte
US Patent
LigandPNGBDBM400941(2-Amino-N-{4-[(3S,5R)-3-amino-5-(trifluoromethyl)p...)
Affinity DataIC50:  55nM. Assay description: Pim-1 and Pim-3 kinase assays-20 μL reactions were run in white 384 well polystyrene plates dotted with 0.8 μL compound/DMSO in the assay b...
Ligand InfoPC cidPC sid
In DepthDetails US Patent