BDBM4010 1 H-indole-3-alkanamide deriv. 10s::1-(benzylcarbamoyl)-2-[2-({3-[2-(benzylcarbamoyl)-2-(acetyloxy)ethyl]-1H-indol-2-yl}disulfanyl)-1H-indol-3-yl]ethyl acetate
SMILES CC(=O)OC(Cc1c(SSc2[nH]c3ccccc3c2CC(OC(C)=O)C(=O)NCc2ccccc2)[nH]c2ccccc12)C(=O)NCc1ccccc1
InChI Key InChIKey=ULJVYCBHZIELSM-UHFFFAOYSA-N
Data  1 IC50
  Tab Delimited (TSV)   2D SDfile   Computed 3D by Vconf -m prep SDfile
Find this compound or compounds like it in BindingDB:
Activity Spreadsheet -- Enzyme Inhibition Constant Data from BindingDB
Found 1 hit for monomerid = 4010
TargetEpidermal growth factor receptor(Homo sapiens (Human))
University Of Auckland
LigandPNGBDBM4010(1 H-indole-3-alkanamide deriv. 10s | 1-(benzylcarb...)
Affinity DataIC50:  2.80E+4nMpH: 7.4 T: 2°C. Assay description: IC50 is the inhibitor concentration which inhibits 50% of kinase activity that catalyzes the transfer of the terminal phosphate from [gamma-32P] labe...
In DepthDetails ArticlePubMed