BDBM401012 US10004755, Compound UNC4311A
SMILES CCCCNc1ncc2c(cn(C3CC[C@H](O)CC3)c2n1)-c1ccc(NC2CCN(C)CC2)cc1
InChI Key InChIKey=CPNQAVXQGZKRMM-SELCFAFUSA-N
Data  4 IC50
  Tab Delimited (TSV)   2D SDfile   Computed 3D by Vconf -m prep SDfile
Find this compound or compounds like it in BindingDB:
Activity Spreadsheet -- Enzyme Inhibition Constant Data from BindingDB
Found 4 hits for monomerid = 401012
TargetTyrosine-protein kinase receptor UFO(Homo sapiens (Human))
University Of North Carolina At Chapel Hill
US Patent
LigandPNGBDBM401012(US10004755, Compound UNC4311A)
Affinity DataIC50:  77nM. Assay description: Inhibition constants of MerTK, Flt3, Tyro3 and Axl kinase activity by an active compound as described herein is determined at the Km for ATP using a ...
Ligand InfoPC cidPC sid
In DepthDetails US Patent
TargetReceptor-type tyrosine-protein kinase FLT3(Homo sapiens (Human))
University Of North Carolina At Chapel Hill
US Patent
LigandPNGBDBM401012(US10004755, Compound UNC4311A)
Affinity DataIC50:  5.30nM. Assay description: Inhibition constants of MerTK, Flt3, Tyro3 and Axl kinase activity by an active compound as described herein is determined at the Km for ATP using a ...
Ligand InfoPC cidPC sid
In DepthDetails US Patent
TargetTyrosine-protein kinase receptor TYRO3(Homo sapiens (Human))
University Of North Carolina At Chapel Hill
US Patent
LigandPNGBDBM401012(US10004755, Compound UNC4311A)
Affinity DataIC50:  45nM. Assay description: Inhibition constants of MerTK, Flt3, Tyro3 and Axl kinase activity by an active compound as described herein is determined at the Km for ATP using a ...
Ligand InfoPC cidPC sid
In DepthDetails US Patent
TargetTyrosine-protein kinase Mer(Homo sapiens (Human))
University Of North Carolina At Chapel Hill
US Patent
LigandPNGBDBM401012(US10004755, Compound UNC4311A)
Affinity DataIC50:  7.60nM. Assay description: Inhibition constants of MerTK, Flt3, Tyro3 and Axl kinase activity by an active compound as described herein is determined at the Km for ATP using a ...
Ligand InfoPC cidPC sid
In DepthDetails US Patent