BDBM401034 US10005735, Compound 32
SMILES Sc1cccc2cc(cnc12)C(=O)NCCOCCOCCOCCNC(=O)CCCC[C@@H]1SC[C@@H]2NC(=O)N[C@H]12
InChI Key InChIKey=JZFQVAYCSXOSIS-KJOQGJGQSA-N
Data  3 IC50
  Tab Delimited (TSV)   2D SDfile   Computed 3D by Vconf -m prep SDfile
Find this compound or compounds like it in BindingDB:
Activity Spreadsheet -- Enzyme Inhibition Constant Data from BindingDB
Found 3 hits for monomerid = 401034
Target26S proteasome non-ATPase regulatory subunit 14(Homo sapiens (Human))
California Institute Of Technology
US Patent
LigandPNGBDBM401034(US10005735, Compound 32)
Affinity DataIC50:  400nM. Assay description: In brief, this Rpn11 bioassay employs a fluorescent polarization readout based on the ability of the 26S proteasome to cleave the protein substrate i...
Ligand InfoPC cidPC sid
In DepthDetails US Patent
TargetAMSH-like protease(Homo sapiens (Human))
California Institute Of Technology
US Patent
LigandPNGBDBM401034(US10005735, Compound 32)
Affinity DataIC50:  400nM. Assay description: In brief, this Rpn11 bioassay employs a fluorescent polarization readout based on the ability of the 26S proteasome to cleave the protein substrate i...
Ligand InfoPC cidPC sid
In DepthDetails US Patent
TargetCOP9 signalosome complex subunit 5(Homo sapiens (Human))
California Institute Of Technology
US Patent
LigandPNGBDBM401034(US10005735, Compound 32)
Affinity DataIC50:  1.38E+4nM. Assay description: In brief, this Rpn11 bioassay employs a fluorescent polarization readout based on the ability of the 26S proteasome to cleave the protein substrate i...
Ligand InfoPC cidPC sid
In DepthDetails US Patent