BDBM401185 7-[[(3S)-3-(Aminomethyl)pyrrolidin-1-yl]methyl]-8-chloro-3-[(5-chloro-2-ethylsulfonylphenyl)methyl]-6-(trifluoromethyl)quinazolin-4-one::US10005739, Example 586
SMILES CCS(=O)(=O)c1ccc(Cl)cc1Cn1cnc2c(Cl)c(CN3CC[C@@H](CN)C3)c(cc2c1=O)C(F)(F)F
InChI Key InChIKey=RJRGAJVXZAEEEK-AWEZNQCLSA-N
Data  1 IC50
  Tab Delimited (TSV)   2D SDfile   Computed 3D by Vconf -m prep SDfile
Find this compound or compounds like it in BindingDB:
Activity Spreadsheet -- Enzyme Inhibition Constant Data from BindingDB
Found 1 hit for monomerid = 401185
TargetEpithelial discoidin domain-containing receptor 1(Homo sapiens (Human))
Chugai Seiyaku Kabushiki Kaisha
US Patent
LigandPNGBDBM401185(7-[[(3S)-3-(Aminomethyl)pyrrolidin-1-yl]methyl]-8-...)
Affinity DataIC50:  27nM. Assay description: DDR1 binding activity was measured using the LanthaScreen (Registered trademark) Eu Kinase Binding Assay (manufactured by Life Technologies Corporati...
Ligand InfoPC cidPC sid
In DepthDetails US Patent