BDBM401251 US10005756, Compound A13
SMILES OC1CN(C(=O)C1(O)C(=O)NCc1cc(F)cc(Cl)c1)c1ccccc1
InChI Key InChIKey=IQYQVCISRGVDRB-UHFFFAOYSA-N
Data  1 IC50
  Tab Delimited (TSV)   2D SDfile   Computed 3D by Vconf -m prep SDfile
Find this compound or compounds like it in BindingDB:
Activity Spreadsheet -- Enzyme Inhibition Constant Data from BindingDB
Found 1 hit for monomerid = 401251
TargetMethionine aminopeptidase 2(Homo sapiens (Human))
Merck Patent
US Patent
LigandPNGBDBM401251(US10005756, Compound A13)
Affinity DataIC50:  140nM. Assay description: The MetAP-2 activity is determined by coupling enzymatic reactions. The tripeptide Met-Arg-Ser (MAS) is employed as substrate. The methionine liberat...
Ligand InfoPC cidPC sid
In DepthDetails US Patent