BDBM401256 US10005756, Compound A19
SMILES Nc1ccc(cc1\C=C\C(O)=O)N1CCC(O)(C(=O)NCc2cc(F)cc(Cl)c2)C1=O
InChI Key InChIKey=IAPCHOGZLWCGPV-DAFODLJHSA-N
Data  1 IC50
  Tab Delimited (TSV)   2D SDfile   Computed 3D by Vconf -m prep SDfile
Find this compound or compounds like it in BindingDB:
Activity Spreadsheet -- Enzyme Inhibition Constant Data from BindingDB
Found 1 hit for monomerid = 401256
TargetMethionine aminopeptidase 2(Homo sapiens (Human))
Merck Patent
US Patent
LigandPNGBDBM401256(US10005756, Compound A19)
Affinity DataIC50:  4.60E+3nM. Assay description: The MetAP-2 activity is determined by coupling enzymatic reactions. The tripeptide Met-Arg-Ser (MAS) is employed as substrate. The methionine liberat...
Ligand InfoPC cidPC sid
In DepthDetails US Patent