BDBM401286 US10005756, Compound A53
SMILES O[C@@]1(CCN(C1=O)c1cnc2[nH]cc(F)c2c1)C(=O)NCc1cc(F)cc(Cl)c1
InChI Key InChIKey=YYCZBNXZDSVEAF-IBGZPJMESA-N
Data  1 IC50
  Tab Delimited (TSV)   2D SDfile   Computed 3D by Vconf -m prep SDfile
Find this compound or compounds like it in BindingDB:
Activity Spreadsheet -- Enzyme Inhibition Constant Data from BindingDB
Found 1 hit for monomerid = 401286
TargetMethionine aminopeptidase 2(Homo sapiens (Human))
Merck Patent
US Patent
LigandPNGBDBM401286(US10005756, Compound A53)
Affinity DataIC50:  100nM. Assay description: The MetAP-2 activity is determined by coupling enzymatic reactions. The tripeptide Met-Arg-Ser (MAS) is employed as substrate. The methionine liberat...
Ligand InfoPC cidPC sid
In DepthDetails US Patent