BDBM401303 US10005756, Compound A74
SMILES OB1OCCc2cc(ccc12)N1CCC(O)(C(=O)NCc2cc(F)cc(Cl)c2)C1=O
InChI Key InChIKey=JBZSWGYZHQUOJU-UHFFFAOYSA-N
Data  1 IC50
  Tab Delimited (TSV)   2D SDfile   Computed 3D by Vconf -m prep SDfile
Find this compound or compounds like it in BindingDB:
Activity Spreadsheet -- Enzyme Inhibition Constant Data from BindingDB
Found 1 hit for monomerid = 401303
TargetMethionine aminopeptidase 2(Homo sapiens (Human))
Merck Patent
US Patent
LigandPNGBDBM401303(US10005756, Compound A74)
Affinity DataIC50:  120nM. Assay description: The MetAP-2 activity is determined by coupling enzymatic reactions. The tripeptide Met-Arg-Ser (MAS) is employed as substrate. The methionine liberat...
Ligand InfoPC cidPC sid
In DepthDetails US Patent