BDBM401334 US10005762, Example 14
SMILES CCCCCC#Cc1cc(C[C@@](O)([C@@H](N)CC(C)C)C(O)=O)ncc1C
InChI Key InChIKey=SGEYKTNPUZDZSI-PZJWPPBQSA-N
Data  2 IC50
  Tab Delimited (TSV)   2D SDfile   Computed 3D by Vconf -m prep SDfile
Find this compound or compounds like it in BindingDB:
Activity Spreadsheet -- Enzyme Inhibition Constant Data from BindingDB
Found 2 hits for monomerid = 401334
TargetLeucyl-cystinyl aminopeptidase(Homo sapiens (Human))
Astellas Pharma
US Patent
LigandPNGBDBM401334(US10005762, Example 14)
Affinity DataIC50:  90nM. Assay description: The inventors have assumed that inhibition of nocturnal activity of placental leucine aminopeptidase (P-LAP), i.e. aminopeptidase that cleaves AVP, w...
Ligand InfoPC cidPC sid
In DepthDetails US Patent
TargetLeucyl-cystinyl aminopeptidase(Rattus norvegicus)
Astellas Pharma
US Patent
LigandPNGBDBM401334(US10005762, Example 14)
Affinity DataIC50:  93nM. Assay description: The inventors have assumed that inhibition of nocturnal activity of placental leucine aminopeptidase (P-LAP), i.e. aminopeptidase that cleaves AVP, w...
Ligand InfoPC cidPC sid
In DepthDetails US Patent