BDBM401351 US10005762, Example 31
SMILES Cc1cnc(C[C@@](O)([C@@H](N)CC2(C)CC2)C(O)=O)cc1CCCC1CC1
InChI Key InChIKey=JKFYYSLYXRSADM-GHTZIAJQSA-N
Data  2 IC50
  Tab Delimited (TSV)   2D SDfile   Computed 3D by Vconf -m prep SDfile
Find this compound or compounds like it in BindingDB:
Activity Spreadsheet -- Enzyme Inhibition Constant Data from BindingDB
Found 2 hits for monomerid = 401351
TargetLeucyl-cystinyl aminopeptidase(Homo sapiens (Human))
Astellas Pharma
US Patent
LigandPNGBDBM401351(US10005762, Example 31)
Affinity DataIC50:  3.40nM. Assay description: The inventors have assumed that inhibition of nocturnal activity of placental leucine aminopeptidase (P-LAP), i.e. aminopeptidase that cleaves AVP, w...
Ligand InfoPC cidPC sid
In DepthDetails US Patent
TargetLeucyl-cystinyl aminopeptidase(Rattus norvegicus)
Astellas Pharma
US Patent
LigandPNGBDBM401351(US10005762, Example 31)
Affinity DataIC50:  4.40nM. Assay description: The inventors have assumed that inhibition of nocturnal activity of placental leucine aminopeptidase (P-LAP), i.e. aminopeptidase that cleaves AVP, w...
Ligand InfoPC cidPC sid
In DepthDetails US Patent