BDBM401452 (S)-1-(6-(4-(2-(((S)-3- hydroxypyrrolidin-1-yl)methyl)- 4-(trifluoromethyl)phenoxy)- phenyl)pyridin-2-yl)ethane-1,2- diol::US10005768, Compound 75
SMILES OC[C@@H](O)c1cccc(n1)-c1ccc(Oc2ccc(cc2CN2CC[C@H](O)C2)C(F)(F)F)cc1
InChI Key InChIKey=ZFVBSSGKRWPBQW-WMZHIEFXSA-N
Data  1 IC50
  Tab Delimited (TSV)   2D SDfile   Computed 3D by Vconf -m prep SDfile
Find this compound or compounds like it in BindingDB:
Activity Spreadsheet -- Enzyme Inhibition Constant Data from BindingDB
Found 1 hit for monomerid = 401452
TargetSodium channel protein type 9 subunit alpha(Homo sapiens (Human))
Purdue Pharma
US Patent
LigandPNGBDBM401452((S)-1-(6-(4-(2-(((S)-3- hydroxypyrrolidin-1-yl)met...)
Affinity DataIC50:  972nM. Assay description: The assay buffer was formulated by removing 120 mL from a 1 L bottle of fresh, sterile dH2O (Mediatech, Herndon, Va.) and adding 100 mL of 10×HBSS th...
Ligand InfoPC cidPC sid
In DepthDetails US Patent